Target
Polyphenol oxidase 2
Ligand
BDBM50236967
Substrate
Meas. Tech.
ChEMBL_475650 (CHEMBL940777)
IC50
540±n/a nM
Citation
 Liu, JYi, WWan, YMa, LSong, H 1-(1-Arylethylidene)thiosemicarbazide derivatives: a new class of tyrosinase inhibitors. Bioorg Med Chem 16:1096-102 (2008)  
Target
Name:
Polyphenol oxidase 2
Synonyms:
Monophenol monooxygenase PPO2 Tyrosinase
Type:
Protein
Mol. Mass.:
63923.66
Organism:
Agaricus bisporus (Common mushroom)
Description:
O42713
Residue:
556
  
Inhibitor
Name:
BDBM50236967
Synonyms:
1-(4-(4-Hydroxyphenyl)butan-2-ylidene)-thiosemicarbazide CHEMBL272958
Type:
Small organic molecule
Emp. Form.:
C11H15N3OS
Mol. Mass.:
237.321
SMILES:
CC(CCc1ccc(O)cc1)=NNC(N)=S
: