Target
Transient receptor potential cation channel subfamily V member 1
Ligand
BDBM50376268
Substrate
Meas. Tech.
ChEMBL_475763 (CHEMBL930279)
Ki
16±n/a nM
Citation
 Jetter, MCMcNally, JJYoungman, MAMcDonnell, MEDubin, AENasser, NZhang, SPCodd, EEColburn, RWStone, DRBrandt, MRFlores, CMDax, SL N-pyridin-3-yl- and N-quinolin-3-yl-benzamides: modulators of human vanilloid receptor 1 (TRPV1). Bioorg Med Chem Lett 18:2730-4 (2008)  
Target
Name:
Transient receptor potential cation channel subfamily V member 1
Synonyms:
Capsaicin receptor Osm-9-like TRP channel 1 TRPV1_HUMAN Transient receptor potential cation channel subfamily V member 1 (TRPV1) Transient receptor potential cation channel subfamily V member 1(TRPV1) Vanilloid VR1 Vanilloid receptor 1 Vanilloid receptor 1 (VRI/TRPV1)
Type:
Protein
Mol. Mass.:
94960.75
Organism:
Homo sapiens (Human)
Description:
Q8NER1
Residue:
839
  
Inhibitor
Name:
BDBM50376268
Synonyms:
CHEMBL405387
Type:
Small organic molecule
Emp. Form.:
C24H27N3O
Mol. Mass.:
373.4907
SMILES:
CN(CC1CCCCC1)c1ccc(cc1)C(=O)Nc1cnc2ccccc2c1
: