Target
Carbonic anhydrase 13
Ligand
BDBM10884
Substrate
Meas. Tech.
ChEMBL_475794 (CHEMBL935619)
Ki
18±n/a nM
Citation
 Di Fiore, APedone, CAntel, JWaldeck, HWitte, AWurl, MScozzafava, ASupuran, CTDe Simone, G Carbonic anhydrase inhibitors: the X-ray crystal structure of ethoxzolamide complexed to human isoform II reveals the importance of thr200 and gln92 for obtaining tight-binding inhibitors. Bioorg Med Chem Lett 18:2669-74 (2008)  
Target
Name:
Carbonic anhydrase 13
Synonyms:
CA-XIII Ca13 Carbonate dehydratase XIII Carbonic anhydrase XIII
Type:
Enzyme
Mol. Mass.:
29522.80
Organism:
Mus musculus (mouse)
Description:
Murine cloned isozyme
Residue:
262
  
Inhibitor
Name:
BDBM10884
Synonyms:
(2S,4S)-4-(ethylamino)-2-methyl-1,1-dioxo-2H,3H,4H-1,7-thieno[2,3-b]thiopyran-6-sulfonamide Dorzolamide (DZA)
Type:
Small organic molecule
Emp. Form.:
C10H16N2O4S3
Mol. Mass.:
324.44
SMILES:
CCN[C@H]1C[C@H](C)S(=O)(=O)c2sc(cc12)S(N)(=O)=O
: