Target
Carbonic anhydrase 2
Ligand
BDBM13055
Substrate
Meas. Tech.
ChEMBL_476221 (CHEMBL935807)
Ki
340000±n/a nM
Citation
 Maryanoff, BEMcComsey, DFLee, JSmith-Swintosky, VLWang, YMinor, LKTodd, MJ Carbonic anhydrase-II inhibition. what are the true enzyme-inhibitory properties of the sulfamide cognate of topiramate? J Med Chem 51:2518-21 (2008)  
Target
Name:
Carbonic anhydrase 2
Synonyms:
CA-II CAC Carbonate dehydratase II Carbonic anhydrase 2 (CA-II) Carbonic anhydrase C Carbonic anhydrase II (CA-II) Carbonic anhydrase II (hCA II) | Carbonic anhydrase isoenzyme II (hCA II)
Type:
Enzyme
Mol. Mass.:
29250.71
Organism:
Homo sapiens (Human)
Description:
P00918
Residue:
260
  
Inhibitor
Name:
BDBM13055
Synonyms:
CHEMBL283695 Topiramate Sulfamide Analogue 8 | amino-N-{[(1R,2S,6S,9R)-4,4,11,11-tetramethyl-3,5,7,10,12-pentaoxatricyclo[7.3.0.0^{2,6}]dodecan-6-yl]methyl}sulfonamide
Type:
Small organic molecule
Emp. Form.:
C12H22N2O7S
Mol. Mass.:
338.377
SMILES:
CC1(C)O[C@@H]2CO[C@@]3(CNS(N)(=O)=O)OC(C)(C)O[C@H]3[C@@H]2O1
: