Target
Integrin alpha-V/beta-5
Ligand
BDBM50376405
Substrate
Meas. Tech.
ChEMBL_476242 (CHEMBL933517)
IC50
14.3±n/a nM
Citation
 Salvati, MCordero, FMPisaneschi, FMelani, FGratteri, PCini, NBottoncetti, ABrandi, A Synthesis, SAR and in vitro evaluation of new cyclic Arg-Gly-Asp pseudopentapeptides containing a s-cis peptide bond as integrin alphavbeta3 and alphavbeta5 ligands. Bioorg Med Chem 16:4262-71 (2008)  
Target
Name:
Integrin alpha-V/beta-5
Synonyms:
ITGAV/ITGB5 | Integrin beta-5/Vitronectin receptor alpha
Type:
Enzyme
Mol. Mass.:
Description:
Components:
This complex has 2 components.
Component 1
Name:
Integrin alpha-V
Synonyms:
ITAV_HUMAN Integrin alpha-V/alpha-5 VNRA Vitronectin receptor | Vitronectin receptor subunit alpha
Type:
PROTEIN
Mol. Mass.:
116024.92
Organism:
Homo sapiens (Human)
Description:
ChEMBL_582336
Residue:
1048
  
Component 2
Name:
Integrin beta-5
Synonyms:
ITB5_HUMAN | ITGB5
Type:
PROTEIN
Mol. Mass.:
88047.37
Organism:
Homo sapiens (Human)
Description:
EBI_10915
Residue:
799
  
Inhibitor
Name:
BDBM50376405
Synonyms:
CHEMBL408195
Type:
Small organic molecule
Emp. Form.:
C20H30N8O7
Mol. Mass.:
494.5016
SMILES:
[#7]\[#6](-[#7])=[#7]\[#6]-[#6]-[#6]-[#6@@H]-1-[#7]-[#6](=O)[C@@]23[#6]-[#6]-[#6]-[#7]2-[#6](=O)-[#6@H](-[#6]3)-[#7]-[#6](=O)-[#6@H](-[#6]-[#6](-[#8])=O)-[#7]-[#6](=O)-[#6]-[#7]-[#6]-1=O
: