Target
Coagulation factor VIII
Ligand
BDBM50376417
Substrate
Meas. Tech.
ChEMBL_476659 (CHEMBL927172)
IC50
8900±n/a nM
Citation
 Segers, KSperandio, OSack, MFischer, RMiteva, MARosing, JNicolaes, GAVilloutreix, BO Design of protein membrane interaction inhibitors by virtual ligand screening, proof of concept with the C2 domain of factor V. Proc Natl Acad Sci U S A 104:12697-702 (2007)  
Target
Name:
Coagulation factor VIII
Synonyms:
AHF F8 FA8_HUMAN Factor VIII B chain Factor VIIIa heavy chain, 92 kDa isoform Procoagulant component
Type:
Protein
Mol. Mass.:
267036.98
Organism:
Homo sapiens (Human)
Description:
P00451
Residue:
2351
  
Inhibitor
Name:
BDBM50376417
Synonyms:
CHEMBL261865
Type:
Small organic molecule
Emp. Form.:
C24H15ClFN3O6
Mol. Mass.:
495.844
SMILES:
[O-][N+](=O)c1ccc(COc2ccc(Cl)cc2C=C2C(=O)NC(=O)N(C2=O)c2ccccc2F)cc1
: