Target
Coagulation factor V
Ligand
BDBM50376417
Substrate
Meas. Tech.
ChEMBL_476654 (CHEMBL927167)
IC50
14070±n/a nM
Citation
 Segers, KSperandio, OSack, MFischer, RMiteva, MARosing, JNicolaes, GAVilloutreix, BO Design of protein membrane interaction inhibitors by virtual ligand screening, proof of concept with the C2 domain of factor V. Proc Natl Acad Sci U S A 104:12697-702 (2007)  
Target
Name:
Coagulation factor V
Synonyms:
Activated protein C cofactor Coagulation factor V light chain FA5_HUMAN | Proaccelerin, labile factor
Type:
PROTEIN
Mol. Mass.:
251677.76
Organism:
Homo sapiens (Human)
Description:
ChEMBL_476655
Residue:
2224
  
Inhibitor
Name:
BDBM50376417
Synonyms:
CHEMBL261865
Type:
Small organic molecule
Emp. Form.:
C24H15ClFN3O6
Mol. Mass.:
495.844
SMILES:
[O-][N+](=O)c1ccc(COc2ccc(Cl)cc2C=C2C(=O)NC(=O)N(C2=O)c2ccccc2F)cc1
: