Target
Coagulation factor V
Ligand
BDBM50423622
Substrate
Meas. Tech.
ChEMBL_476656 (CHEMBL927169)
IC50
14000±n/a nM
Citation
 Segers, KSperandio, OSack, MFischer, RMiteva, MARosing, JNicolaes, GAVilloutreix, BO Design of protein membrane interaction inhibitors by virtual ligand screening, proof of concept with the C2 domain of factor V. Proc Natl Acad Sci U S A 104:12697-702 (2007)  
Target
Name:
Coagulation factor V
Synonyms:
Activated protein C cofactor Coagulation factor V light chain FA5_HUMAN | Proaccelerin, labile factor
Type:
PROTEIN
Mol. Mass.:
251677.76
Organism:
Homo sapiens (Human)
Description:
ChEMBL_476655
Residue:
2224
  
Inhibitor
Name:
BDBM50423622
Synonyms:
CHEMBL1614804
Type:
Small organic molecule
Emp. Form.:
C23H28Cl2N4O2
Mol. Mass.:
463.4
SMILES:
O[C@@H](COc1ccc(Cl)cc1Cl)Cn1c2ccccc2n(CCN2CCCCC2)c1=N
: