Target
Cytochrome P450 3A4
Ligand
BDBM50376467
Substrate
Meas. Tech.
ChEMBL_476993 (CHEMBL937498)
IC50
1±n/a nM
Citation
 Woltering, TJWichmann, JGoetschi, EAdam, GKew, JNKnoflach, FBallard, TMHuwyler, JMutel, VGatti, S Synthesis and characterization of 1,3-dihydro-benzo[b][1,4]diazepin-2-one derivatives: Part 3. New potent non-competitive metabotropic glutamate receptor 2/3 antagonists. Bioorg Med Chem Lett 18:2725-9 (2008)  
Target
Name:
Cytochrome P450 3A4
Synonyms:
Albendazole monooxygenase CP3A4_HUMAN CYP3A4 CYPIIIA4 Cytochrome P450 3A4 (CYP3A4) Nifedipine oxidase Taurochenodeoxycholate 6-alpha-hydroxylase
Type:
Enzyme
Mol. Mass.:
57349.57
Organism:
Homo sapiens (Human)
Description:
Residue:
503
  
Inhibitor
Name:
BDBM50376467
Synonyms:
CHEMBL260636
Type:
Small organic molecule
Emp. Form.:
C24H17FN4O
Mol. Mass.:
396.4164
SMILES:
Fc1ccccc1-c1ccc2N=C(CC(=O)Nc2c1)c1cccc(c1)-n1ccnc1
: