Target
Muscarinic acetylcholine receptor M4
Ligand
BDBM50376591
Substrate
Meas. Tech.
ChEMBL_477429 (CHEMBL929415)
EC50
138±n/a nM
Citation
 Varoli, LAndreani, ABurnelli, SGranaiola, MLeoni, ALocatelli, AMorigi, RRambaldi, MBedini, AFazio, NSpampinato, S Diphenidol-related diamines as novel muscarinic M4 receptor antagonists. Bioorg Med Chem Lett 18:2972-6 (2008)  
Target
Name:
Muscarinic acetylcholine receptor M4
Synonyms:
ACM4_HUMAN Cholinergic, muscarinic M4 Muscarinic acetylcholine receptor M2 and M4
Type:
Enzyme Catalytic Domain
Mol. Mass.:
53079.31
Organism:
Homo sapiens (Human)
Description:
Cholinergic, muscarinic M4 CHRM4 HUMAN M3::P08173
Residue:
479
  
Inhibitor
Name:
BDBM50376591
Synonyms:
CHEMBL403773
Type:
Small organic molecule
Emp. Form.:
C42H52N2O2
Mol. Mass.:
616.8745
SMILES:
OC(CCCN1CCC(CC1)C1CCN(CCCC(O)(c2ccccc2)c2ccccc2)CC1)(c1ccccc1)c1ccccc1
: