Target
Telomerase reverse transcriptase
Ligand
BDBM50107609
Substrate
Meas. Tech.
ChEMBL_477736 (CHEMBL926070)
IC50
710±n/a nM
Citation
 De Cian, ACristofari, GReichenbach, PDe Lemos, EMonchaud, DTeulade-Fichou, MPShin-Ya, KLacroix, LLingner, JMergny, JL Reevaluation of telomerase inhibition by quadruplex ligands and their mechanisms of action. Proc Natl Acad Sci U S A 104:17347-52 (2007)  
Target
Name:
Telomerase reverse transcriptase
Synonyms:
EST2 TERT TRT
Type:
PROTEIN
Mol. Mass.:
127099.03
Organism:
Homo sapiens (Human)
Description:
ChEMBL_1447029
Residue:
1132
  
Inhibitor
Name:
BDBM50107609
Synonyms:
5,10,15,20-tetra(1-methyl-4-pyridyl)-porphyrin CHEMBL337559 | TMPyP4
Type:
Small organic molecule
Emp. Form.:
C44H38N8
Mol. Mass.:
678.8239
SMILES:
C[n+]1ccc(cc1)-c1c2ccc(n2)c(-c2cc[n+](C)cc2)c2ccc([nH]2)c(-c2cc[n+](C)cc2)c2ccc([nH]2)c(-c2cc[n+](C)cc2)c2ccc1n2
: