Target
4-aminobutyrate aminotransferase, mitochondrial
Ligand
BDBM50376753
Substrate
Meas. Tech.
ChEMBL_477747 (CHEMBL939957)
IC50
>5000000±n/a nM
Citation
 Clift, MDSilverman, RB Synthesis and evaluation of novel aromatic substrates and competitive inhibitors of GABA aminotransferase. Bioorg Med Chem Lett 18:3122-5 (2008)  
Target
Name:
4-aminobutyrate aminotransferase, mitochondrial
Synonyms:
(S)-3-amino-2-methylpropionate transaminase ABAT GABA transaminase GABA-T GABT_HUMAN L-AIBAT
Type:
PROTEIN
Mol. Mass.:
56449.39
Organism:
Homo sapiens (Human)
Description:
ChEMBL_1459248
Residue:
500
  
Inhibitor
Name:
BDBM50376753
Synonyms:
CHEMBL535415
Type:
Small organic molecule
Emp. Form.:
C8H9NO2
Mol. Mass.:
151.1626
SMILES:
NCc1ccccc1C(O)=O
: