Target
Tyrosine-protein kinase Lyn
Ligand
BDBM50376901
Substrate
Meas. Tech.
ChEMBL_478597 (CHEMBL934544)
Ki
4.19±n/a nM
Citation
 Hu, SXSoll, RYee, SLohse, DLKousba, AZeng, BYu, XMcPherson, ARenick, JCao, JTabak, AHood, JDoukas, JNoronha, GMartin, M Metabolism and pharmacokinetics of a novel Src kinase inhibitor TG100435 ([7-(2,6-dichloro-phenyl)-5-methyl-benzo[1,2,4]triazin-3-yl]-[4-(2-pyrrolidin-1-yl-ethoxy)-phenyl]-amine) and its active N-oxide metabolite TG100855 ([7-(2,6-dichloro-phenyl)-5-methylbenzo[1,2,4]triazin-3-yl]-{4-[2-(1-oxy-pyrr Drug Metab Dispos 35:929-36 (2007)  
Target
Name:
Tyrosine-protein kinase Lyn
Synonyms:
JTK8 LYN_HUMAN Tyrosine-protein kinase Lyn (LYN) p53Lyn | p56Lyn
Type:
Protein
Mol. Mass.:
58575.92
Organism:
Homo sapiens (Human)
Description:
P07948
Residue:
512
  
Inhibitor
Name:
BDBM50376901
Synonyms:
CHEMBL256101 | TG-100855
Type:
Small organic molecule
Emp. Form.:
C26H25Cl2N5O2
Mol. Mass.:
510.415
SMILES:
Cc1cc(cc2nnc(Nc3ccc(OCC[N+]4([O-])CCCC4)cc3)nc12)-c1c(Cl)cccc1Cl
: