Target
Adenosine receptor A2a
Ligand
BDBM50376964
Substrate
Meas. Tech.
ChEMBL_478892 (CHEMBL933588)
Ki
261±n/a nM
Citation
 Elzein, EKalla, RVLi, XPerry, TGimbel, AZeng, DLustig, DLeung, KZablocki, J Discovery of a novel A2B adenosine receptor antagonist as a clinical candidate for chronic inflammatory airway diseases. J Med Chem 51:2267-78 (2008)  
Target
Name:
Adenosine receptor A2a
Synonyms:
A2A adenosine receptor (hA2A) ADENOSINE A2 ADORA2 Adenosine A2A receptor (A2AAR)
Type:
G Protein-Coupled Receptor (GPCR)
Mol. Mass.:
44716.46
Organism:
Homo sapiens (Human)
Description:
P29274
Residue:
412
  
Inhibitor
Name:
BDBM50376964
Synonyms:
CHEMBL265212
Type:
Small organic molecule
Emp. Form.:
C20H22N6O2
Mol. Mass.:
378.4277
SMILES:
CCCn1c(=O)n(CC)c2nc([nH]c2c1=O)-c1cnn(Cc2ccccc2)c1
: