Target
NAD-dependent protein deacetylase sirtuin-3, mitochondrial
Ligand
BDBM50376978
Substrate
Meas. Tech.
ChEMBL_479068 (CHEMBL933819)
EC50
>300000±n/a nM
Citation
 Milne, JCLambert, PDSchenk, SCarney, DPSmith, JJGagne, DJJin, LBoss, OPerni, RBVu, CBBemis, JEXie, RDisch, JSNg, PYNunes, JJLynch, AVYang, HGalonek, HIsraelian, KChoy, WIffland, ALavu, SMedvedik, OSinclair, DAOlefsky, JMJirousek, MRElliott, PJWestphal, CH Small molecule activators of SIRT1 as therapeutics for the treatment of type 2 diabetes. Nature 450:712-716 (2007)  
Target
Name:
NAD-dependent protein deacetylase sirtuin-3, mitochondrial
Synonyms:
NAD-dependent deacetylase sirtuin 3 SIR2L3 SIRT3
Type:
Protein
Mol. Mass.:
43582.69
Organism:
Homo sapiens (Human)
Description:
Q9NTG7
Residue:
399
  
Inhibitor
Name:
BDBM50376978
Synonyms:
CHEMBL403308 | SRT-2183
Type:
Small organic molecule
Emp. Form.:
C27H24N4O2S
Mol. Mass.:
468.57
SMILES:
O[C@@H]1CCN(Cc2csc3nc(cn23)-c2ccccc2NC(=O)c2ccc3ccccc3c2)C1
: