Target
Neuronal acetylcholine receptor subunit alpha-7
Ligand
BDBM50377051
Substrate
Meas. Tech.
ChEMBL_479250 (CHEMBL932560)
Ki
18±n/a nM
Citation
 Acker, BAJacobsen, EJRogers, BNWishka, DGReitz, SCPiotrowski, DWMyers, JKWolfe, MLGroppi, VEThornburgh, BATinholt, PMWalters, RROlson, BAFitzgerald, LStaton, BARaub, TJKrause, MLi, KSHoffmann, WEHajos, MHurst, RSWalker, DP Discovery of N-[(3R,5R)-1-azabicyclo[3.2.1]oct-3-yl]furo[2,3-c]pyridine-5-carboxamide as an agonist of the alpha7 nicotinic acetylcholine receptor: in vitro and in vivo activity. Bioorg Med Chem Lett 18:3611-5 (2008)  
Target
Name:
Neuronal acetylcholine receptor subunit alpha-7
Synonyms:
ACHA7_RAT Cholinergic, Nicotinic Alpha7 Chrna7 Neuronal acetylcholine receptor (alpha7 nAChR) Neuronal acetylcholine receptor subunit alpha-7 Neuronal acetylcholine receptor subunit alpha-7 (nAChR)
Type:
Enzyme
Mol. Mass.:
56502.44
Organism:
Rattus norvegicus (Rat)
Description:
Q05941
Residue:
502
  
Inhibitor
Name:
BDBM50377051
Synonyms:
CHEMBL256578
Type:
Small organic molecule
Emp. Form.:
C14H17ClN2O
Mol. Mass.:
264.751
SMILES:
Clc1ccc(cc1)C(=O)N[C@@H]1C[C@H]2CCN(C2)C1
: