Target
Polyphenol oxidase 2
Ligand
BDBM50031467
Substrate
Meas. Tech.
ChEMBL_479308 (CHEMBL933680)
IC50
75000±n/a nM
Citation
 Criton, MLe Mellay-Hamon, V Analogues of N-hydroxy-N'-phenylthiourea and N-hydroxy-N'-phenylurea as inhibitors of tyrosinase and melanin formation. Bioorg Med Chem Lett 18:3607-10 (2008)  
Target
Name:
Polyphenol oxidase 2
Synonyms:
Monophenol monooxygenase PPO2 Tyrosinase
Type:
Protein
Mol. Mass.:
63923.66
Organism:
Agaricus bisporus (Common mushroom)
Description:
O42713
Residue:
556
  
Inhibitor
Name:
BDBM50031467
Synonyms:
5-HYDROXY-2-(HYDROXYMETHYL)-4H-PYRAN-4-ONE CHEMBL287556 US10857082, Kojic acid US9682910, kojic acid
Type:
Small organic molecule
Emp. Form.:
C6H6O4
Mol. Mass.:
142.1094
SMILES:
OCc1cc(=O)c(O)co1
: