Target
Vascular endothelial growth factor receptor 2
Ligand
BDBM50377367
Substrate
Meas. Tech.
ChEMBL_479553 (CHEMBL929417)
IC50
19±n/a nM
Citation
 Ruel, RThibeault, CL'Heureux, AMartel, ACai, ZWWei, DQian, LBarrish, JCMathur, AD'Arienzo, CHunt, JTKamath, AMarathe, PZhang, YDerbin, GWautlet, BMortillo, SJeyaseelan, RHenley, BTejwani, RBhide, RSTrainor, GLFargnoli, JLombardo, LJ Discovery and preclinical studies of 5-isopropyl-6-(5-methyl-1,3,4-oxadiazol-2-yl)-N-(2-methyl-1H-pyrrolo[2,3-b]pyridin-5-yl)pyrrolo[2,1-f][1,2,4]triazin-4-amine (BMS-645737), an in vivo active potent VEGFR-2 inhibitor. Bioorg Med Chem Lett 18:2985-9 (2008)  
Target
Name:
Vascular endothelial growth factor receptor 2
Synonyms:
CD_antigen=CD309 Fetal liver kinase 1 (FLK-1) KDR Protein-tyrosine kinase receptor Flk-1 VEGFR-2 VEGFR2 Vascular Endothelial Growth Factor Receptor Kinase 2 Vascular endothelial growth factor receptor 2 (KDR) Vascular endothelial growth factor receptor 2 (VEGFR2) Vascular endothelial growth factor receptor-2 (VEGFR-2)
Type:
Receptor Tyrosine Kinase
Mol. Mass.:
151510.97
Organism:
Homo sapiens (Human)
Description:
P35968
Residue:
1356
  
Inhibitor
Name:
BDBM50377367
Synonyms:
CHEMBL256116
Type:
Small organic molecule
Emp. Form.:
C18H18FN5O3
Mol. Mass.:
371.3656
SMILES:
C[C@@H](O)COc1cn2ncnc(Oc3cnc4[nH]c(C)cc4c3F)c2c1C
: