Target
Alpha-2A adrenergic receptor
Ligand
BDBM50377396
Substrate
Meas. Tech.
ChEMBL_479655 (CHEMBL922403)
EC50
722±n/a nM
Citation
 Whitlock, GAConlon, KMcMurray, GRoberts, LRStobie, AThurlow, RJ Novel 2-imidazoles as potent and selective alpha1A adrenoceptor partial agonists. Bioorg Med Chem Lett 18:2930-4 (2008)  
Target
Name:
Alpha-2A adrenergic receptor
Synonyms:
ADA2A_HUMAN ADRA2R Adrenergic alpha2A Alpha-2 adrenergic receptor subtype C10 Alpha-2A adrenoreceptor alpha-2A adrenergic receptor [Homo sapiens]
Type:
Enzyme
Mol. Mass.:
48979.91
Organism:
Homo sapiens (Human)
Description:
P08913
Residue:
450
  
Inhibitor
Name:
BDBM50377396
Synonyms:
CHEMBL258007
Type:
Small organic molecule
Emp. Form.:
C13H14N2
Mol. Mass.:
198.2637
SMILES:
C1CC(c2ncc[nH]2)c2ccccc2C1
: