Target
Adenosine receptor A1
Ligand
BDBM50151865
Substrate
Meas. Tech.
ChEMBL_479700 (CHEMBL933564)
Ki
14044±n/a nM
Citation
 Gillespie, RJAdams, DRBebbington, DBenwell, KCliffe, IADawson, CEDourish, CTFletcher, AGaur, SGiles, PRJordan, AMKnight, ARKnutsen, LJLawrence, ALerpiniere, JMisra, APorter, RHPratt, RMShepherd, RUpton, RWard, SEWeiss, SMWilliamson, DS Antagonists of the human adenosine A2A receptor. Part 1: Discovery and synthesis of thieno[3,2-d]pyrimidine-4-methanone derivatives. Bioorg Med Chem Lett 18:2916-9 (2008)  
Target
Name:
Adenosine receptor A1
Synonyms:
A1 adenosine receptor (hA1) AA1R_HUMAN ADORA1 Adenosine A1-receptor Adenosine receptor A1 (hA1) | Adenosine transporter (AdT)
Type:
G Protein-Coupled Receptor (GPCR)
Mol. Mass.:
36520.92
Organism:
Homo sapiens (Human)
Description:
P30542
Residue:
326
  
Inhibitor
Name:
BDBM50151865
Synonyms:
CHEMBL172 | MEFLOQUINE
Type:
Small organic molecule
Emp. Form.:
C17H16F6N2O
Mol. Mass.:
378.3122
SMILES:
O[C@H]([C@H]1CCCCN1)c1cc(nc2c(cccc12)C(F)(F)F)C(F)(F)F
: