Target
Adenosine receptor A2a
Ligand
BDBM50377492
Substrate
Meas. Tech.
ChEMBL_479703 (CHEMBL933567)
Ki
1.6±n/a nM
Citation
 Gillespie, RJCliffe, IADawson, CEDourish, CTGaur, SGiles, PRJordan, AMKnight, ARLawrence, ALerpiniere, JMisra, APratt, RMTodd, RSUpton, RWeiss, SMWilliamson, DS Antagonists of the human adenosine A2A receptor. Part 2: Design and synthesis of 4-arylthieno[3,2-d]pyrimidine derivatives. Bioorg Med Chem Lett 18:2920-3 (2008)  
Target
Name:
Adenosine receptor A2a
Synonyms:
A2A adenosine receptor (hA2A) ADENOSINE A2 ADORA2 Adenosine A2A receptor (A2AAR)
Type:
G Protein-Coupled Receptor (GPCR)
Mol. Mass.:
44716.46
Organism:
Homo sapiens (Human)
Description:
P29274
Residue:
412
  
Inhibitor
Name:
BDBM50377492
Synonyms:
CHEMBL407650
Type:
Small organic molecule
Emp. Form.:
C11H9N3S2
Mol. Mass.:
247.339
SMILES:
CCc1nc(-c2nccs2)c2sccc2n1
: