Target
Adenosine receptor A2a
Ligand
BDBM50377556
Substrate
Meas. Tech.
ChEMBL_479713 (CHEMBL921473)
Ki
1±n/a nM
Citation
 Gillespie, RJCliffe, IADawson, CEDourish, CTGaur, SJordan, AMKnight, ARLerpiniere, JMisra, APratt, RMRoffey, JStratton, GCUpton, RWeiss, SMWilliamson, DS Antagonists of the human adenosine A2A receptor. Part 3: Design and synthesis of pyrazolo[3,4-d]pyrimidines, pyrrolo[2,3-d]pyrimidines and 6-arylpurines. Bioorg Med Chem Lett 18:2924-9 (2008)  
Target
Name:
Adenosine receptor A2a
Synonyms:
A2A adenosine receptor (hA2A) ADENOSINE A2 ADORA2 Adenosine A2A receptor (A2AAR)
Type:
G Protein-Coupled Receptor (GPCR)
Mol. Mass.:
44716.46
Organism:
Homo sapiens (Human)
Description:
P29274
Residue:
412
  
Inhibitor
Name:
BDBM50377556
Synonyms:
CHEMBL411034
Type:
Small organic molecule
Emp. Form.:
C17H13ClN6O2
Mol. Mass.:
368.777
SMILES:
Nc1nc(-c2ccco2)c2ncn(C(=O)NCc3ccccc3Cl)c2n1
: