Target
Adenosine receptor A2a
Ligand
BDBM50377566
Substrate
Meas. Tech.
ChEMBL_479713 (CHEMBL921473)
Ki
1±n/a nM
Citation
 Gillespie, RJCliffe, IADawson, CEDourish, CTGaur, SJordan, AMKnight, ARLerpiniere, JMisra, APratt, RMRoffey, JStratton, GCUpton, RWeiss, SMWilliamson, DS Antagonists of the human adenosine A2A receptor. Part 3: Design and synthesis of pyrazolo[3,4-d]pyrimidines, pyrrolo[2,3-d]pyrimidines and 6-arylpurines. Bioorg Med Chem Lett 18:2924-9 (2008)  
Target
Name:
Adenosine receptor A2a
Synonyms:
A2A adenosine receptor (hA2A) ADENOSINE A2 ADORA2 Adenosine A2A receptor (A2AAR)
Type:
G Protein-Coupled Receptor (GPCR)
Mol. Mass.:
44716.46
Organism:
Homo sapiens (Human)
Description:
P29274
Residue:
412
  
Inhibitor
Name:
BDBM50377566
Synonyms:
CHEMBL259049
Type:
Small organic molecule
Emp. Form.:
C18H16N6O2
Mol. Mass.:
348.3586
SMILES:
Cc1cccc(CNC(=O)n2cnc3c(nc(N)nc23)-c2ccco2)c1
: