Target
Adenosine receptor A2a
Ligand
BDBM50118812
Substrate
Meas. Tech.
ChEMBL_479903 (CHEMBL935756)
Ki
1000±n/a nM
Citation
 Melman, AGao, ZGKumar, DWan, TCGizewski, EAuchampach, JAJacobson, KA Design of (N)-methanocarba adenosine 5'-uronamides as species-independent A3 receptor-selective agonists. Bioorg Med Chem Lett 18:2813-9 (2008)  
Target
Name:
Adenosine receptor A2a
Synonyms:
AA2AR_MOUSE Adenosine receptor A2a | Adora2a
Type:
PROTEIN
Mol. Mass.:
44984.04
Organism:
Mus musculus
Description:
ChEMBL_479903
Residue:
410
  
Inhibitor
Name:
BDBM50118812
Synonyms:
(2S,3S,4R,5R)-3,4-Dihydroxy-5-[6-(3-iodo-benzylamino)-purin-9-yl]-tetrahydro-furan-2-carboxylic acid methylamide (2S,3S,4R,5R)-5-(6-(3-iodobenzylamino)-9H-purin-9-yl)-3,4-dihydroxy-N-methyl-tetrahydrofuran-2-carboxamide (3S,4R,5R)-3,4-Dihydroxy-5-[6-(3-iodo-benzylamino)-purin-9-yl]-tetrahydro-furan-2-carboxylic acid methylamide 3,4-Dihydroxy-5-[6-(3-iodo-benzylamino)-purin-9-yl]-tetrahydro-furan-2-carboxylic acid methylamide IB-MECA | N6-(3-iodobenzyl)-5'-N-methylcarboxamidoadenosine
Type:
Small organic molecule
Emp. Form.:
C18H19IN6O4
Mol. Mass.:
510.2857
SMILES:
CNC(=O)[C@H]1O[C@H]([C@H](O)[C@@H]1O)n1cnc2c(NCc3cccc(I)c3)ncnc12
: