Target
Protein kinase C delta type
Ligand
BDBM50239328
Substrate
Meas. Tech.
ChEMBL_480040 (CHEMBL927979)
Ki
96±n/a nM
Citation
 Boschelli, DHWu, BBarrios Sosa, ACChen, JAsselin, MCole, DCLee, JYang, XChaudhary, D Synthesis and PKCtheta inhibitory activity of a series of 4-(indol-5-ylamino)thieno[2,3-b]pyridine-5-carbonitriles. Bioorg Med Chem Lett 18:2850-3 (2008)  
Target
Name:
Protein kinase C delta type
Synonyms:
KPCD_HUMAN PKCD Protein Kinase C- delta nPKC-delta
Type:
Enzyme
Mol. Mass.:
77516.79
Organism:
Homo sapiens (Human)
Description:
The recombinant human PKC enzymes were produced using a baculovirus expression system in SF9 cells
Residue:
676
  
Inhibitor
Name:
BDBM50239328
Synonyms:
2-(3-((dimethylamino)methyl)phenyl)-4-(4-methyl-1H-indol-5-ylamino)thieno[2,3-b]pyridine-5-carbonitrile | CHEMBL402818
Type:
Small organic molecule
Emp. Form.:
C26H23N5S
Mol. Mass.:
437.559
SMILES:
CN(C)Cc1cccc(c1)-c1cc2c(Nc3ccc4[nH]ccc4c3C)c(cnc2s1)C#N
: