Target
Beta-secretase 1
Ligand
BDBM50377849
Substrate
Meas. Tech.
ChEMBL_480068 (CHEMBL929344)
Ki
272±n/a nM
Citation
 Park, HMin, KKwak, HSKoo, KDLim, DSeo, SWChoi, JUPlatt, BChoi, DY Synthesis, SAR, and X-ray structure of human BACE-1 inhibitors with cyclic urea derivatives. Bioorg Med Chem Lett 18:2900-4 (2008)  
Target
Name:
Beta-secretase 1
Synonyms:
ASP2 Aspartyl protease 2 BACE1 Beta-secretase (BACE) Beta-secretase 1 (BACE 1) Beta-secretase 1 (BACE1) Beta-site amyloid precursor protein cleaving enzyme 1 Memapsin-2 beta-Secretase (BACE-1) | beta-Secretase (BACE1)
Type:
Protein
Mol. Mass.:
55755.10
Organism:
Homo sapiens (Human)
Description:
P56817
Residue:
501
  
Inhibitor
Name:
BDBM50377849
Synonyms:
CHEMBL260634
Type:
Small organic molecule
Emp. Form.:
C30H35F2N5O3
Mol. Mass.:
551.6274
SMILES:
CN(C)c1cccc(CNC[C@@H](O)[C@H](Cc2ccccc2)NC(=O)[C@@H]2CN(Cc3ccc(F)c(F)c3)C(=O)N2)c1
: