Target
Cathepsin D
Ligand
BDBM50377849
Substrate
Meas. Tech.
ChEMBL_480069 (CHEMBL929345)
Ki
354±n/a nM
Citation
 Park, HMin, KKwak, HSKoo, KDLim, DSeo, SWChoi, JUPlatt, BChoi, DY Synthesis, SAR, and X-ray structure of human BACE-1 inhibitors with cyclic urea derivatives. Bioorg Med Chem Lett 18:2900-4 (2008)  
Target
Name:
Cathepsin D
Synonyms:
CATD_HUMAN CTSD Cathepsin D heavy chain Cathepsin D precursor
Type:
Enzyme
Mol. Mass.:
44551.72
Organism:
Homo sapiens (Human)
Description:
Human proCathepsin D (SwissProt accession number P07339) was expressed in Sf9 cells, purified, and autoactivated.
Residue:
412
  
Inhibitor
Name:
BDBM50377849
Synonyms:
CHEMBL260634
Type:
Small organic molecule
Emp. Form.:
C30H35F2N5O3
Mol. Mass.:
551.6274
SMILES:
CN(C)c1cccc(CNC[C@@H](O)[C@H](Cc2ccccc2)NC(=O)[C@@H]2CN(Cc3ccc(F)c(F)c3)C(=O)N2)c1
: