Target
Polyunsaturated fatty acid lipoxygenase ALOX12
Ligand
BDBM50242010
Substrate
Meas. Tech.
ChEMBL_502462 (CHEMBL986635)
IC50
260±n/a nM
Citation
 Amagata, TWhitman, SJohnson, TAStessman, CCLoo, CPLobkovsky, EClardy, JCrews, PHolman, TR Exploring sponge-derived terpenoids for their potency and selectivity against 12-human, 15-human, and 15-soybean lipoxygenases. J Nat Prod 66:230-5 (2003)  
Target
Name:
Polyunsaturated fatty acid lipoxygenase ALOX12
Synonyms:
12-LOX 12LO Arachidonate 12-lipoxygenase LOG12 Platelet 12-lipoxygenase | Platelet-type lipoxygenase 12
Type:
Protein
Mol. Mass.:
75689.18
Organism:
Homo sapiens (Human)
Description:
P18054
Residue:
663
  
Inhibitor
Name:
BDBM50242010
Synonyms:
(+)-(5S,8S,9R,10S)-20-methoxypuupehenone | CHEMBL463805
Type:
Small organic molecule
Emp. Form.:
C22H30O3
Mol. Mass.:
342.4718
SMILES:
COC1=CC2=C[C@H]3[C@](C)(CC[C@H]4C(C)(C)CCC[C@]34C)OC2=CC1=O
: