Target
Calcium/calmodulin-dependent protein kinase type II subunit alpha
Ligand
BDBM4814
Substrate
Meas. Tech.
ChEMBL_531325 (CHEMBL989737)
Kd
370±n/a nM
Citation
 McDermott, USharma, SVDowell, LGreninger, PMontagut, CLamb, JArchibald, HRaudales, RTam, ALee, DRothenberg, SMSupko, JGSordella, RUlkus, LEIafrate, AJMaheswaran, SNjauw, CNTsao, HDrew, LHanke, JHMa, XJErlander, MGGray, NSHaber, DASettleman, J Identification of genotype-correlated sensitivity to selective kinase inhibitors by using high-throughput tumor cell line profiling. Proc Natl Acad Sci U S A 104:19936-41 (2007)  
Target
Name:
Calcium/calmodulin-dependent protein kinase type II subunit alpha
Synonyms:
CAMK2A CaM kinase II Calcium/calmodulin-dependent protein kinase type II subunit alpha (CAMK2a) KIAA0968
Type:
Enzyme Catalytic Domain
Mol. Mass.:
54093.63
Organism:
Homo sapiens (Human)
Description:
gi_25952118
Residue:
478
  
Inhibitor
Name:
BDBM4814
Synonyms:
CHEMBL535 N-[2-(diethylamino)ethyl]-5-{[(3Z)-5-fluoro-2-oxo-2,3-dihydro-1H-indol-3-ylidene]methyl}-2,4-dimethyl-1H-pyrrole-3-carboxamide SUNITINIB US10464902, Sunitinib US9914707, SU11248
Type:
Small organic molecule
Emp. Form.:
C22H27FN4O2
Mol. Mass.:
398.4738
SMILES:
CCN(CC)CCNC(=O)c1c(C)[nH]c(\C=C2/C(=O)Nc3ccc(F)cc23)c1C
: