Target
RAC-beta serine/threonine-protein kinase
Ligand
BDBM50306682
Substrate
Meas. Tech.
ChEMBL_531408 (CHEMBL966763)
IC50
>10000±n/a nM
Citation
 McDermott, USharma, SVDowell, LGreninger, PMontagut, CLamb, JArchibald, HRaudales, RTam, ALee, DRothenberg, SMSupko, JGSordella, RUlkus, LEIafrate, AJMaheswaran, SNjauw, CNTsao, HDrew, LHanke, JHMa, XJErlander, MGGray, NSHaber, DASettleman, J Identification of genotype-correlated sensitivity to selective kinase inhibitors by using high-throughput tumor cell line profiling. Proc Natl Acad Sci U S A 104:19936-41 (2007)  
Target
Name:
RAC-beta serine/threonine-protein kinase
Synonyms:
AKT2 PKB beta Protein kinase B (Akt 2) Protein kinase B, beta RAC-alpha serine/threonine-protein kinase (AKT2) RAC-beta serine/threonine-protein kinase (AKT2) Serine/threonine-protein kinase AKT2 | Serine/threonine-protein kinase Rac alpha/beta
Type:
Enzyme
Mol. Mass.:
55766.64
Organism:
Homo sapiens (Human)
Description:
Residue:
481
  
Inhibitor
Name:
BDBM50306682
Synonyms:
(R)-3-(1-(2,6-dichloro-3-fluorophenyl)ethoxy)-5-(1-(piperidin-4-yl)-1H-pyrazol-4-yl)pyridin-2-amine 3-[(1R)-1-(2,6-dichloro-3-fluorophenyl)ethoxy]-5-(1-piperidin-4-yl-1H-pyrazol-4-yl)pyridin-2-amine CRIZOTINIB US10370379, Crizotinib US10780082, Compound Crizotinib US11517561, Compound Crizotinib US9199944, Crizotinib | US9226923, Crizotinib
Type:
Small organic molecule
Emp. Form.:
C21H22Cl2FN5O
Mol. Mass.:
450.337
SMILES:
C[C@@H](Oc1cc(cnc1N)-c1cnn(c1)C1CCNCC1)c1c(Cl)ccc(F)c1Cl
: