Target
Cannabinoid receptor 2
Ligand
BDBM50260803
Substrate
Meas. Tech.
ChEMBL_556358 (CHEMBL954091)
Ki
>50000±n/a nM
Citation
 Wustrow, DJMaynard, GDYuan, JZhao, HMao, JGuo, QKershaw, MHammer, JBrodbeck, RMNear, KEZhou, DBeers, DSChenard, BLKrause, JEHutchison, AJ Aminopyrazine CB1 receptor inverse agonists. Bioorg Med Chem Lett 18:3376-81 (2008)  
Target
Name:
Cannabinoid receptor 2
Synonyms:
CANNABINOID CB2 CB2 CB2B CNR2_HUMAN Cannabinoid CB2 receptor Cannabinoid receptor 2 (CB2R) | hCB2
Type:
G Protein-Coupled Receptor (GPCR)
Mol. Mass.:
39690.94
Organism:
Homo sapiens (Human)
Description:
P34972
Residue:
360
  
Inhibitor
Name:
BDBM50260803
Synonyms:
1-(6-(2-chloropyridin-4-yl)-5-(4-(trifluoromethyl)phenyl)pyrazin-2-yl)-3-(ethylamino)azetidine-3-carboxamide | CHEMBL498783
Type:
Small organic molecule
Emp. Form.:
C22H20ClF3N6O
Mol. Mass.:
476.882
SMILES:
CCNC1(CN(C1)c1cnc(-c2ccc(cc2)C(F)(F)F)c(n1)-c1ccnc(Cl)c1)C(N)=O
: