Target
Cannabinoid receptor 1
Ligand
BDBM50260720
Substrate
Meas. Tech.
ChEMBL_556337 (CHEMBL954070)
Ki
2.84±n/a nM
Citation
 Wustrow, DJMaynard, GDYuan, JZhao, HMao, JGuo, QKershaw, MHammer, JBrodbeck, RMNear, KEZhou, DBeers, DSChenard, BLKrause, JEHutchison, AJ Aminopyrazine CB1 receptor inverse agonists. Bioorg Med Chem Lett 18:3376-81 (2008)  
Target
Name:
Cannabinoid receptor 1
Synonyms:
CANN6 CB-R CNR CNR1_HUMAN Cannabinoid receptor Cannabinoid receptor 1 (brain)
Type:
G Protein-Coupled Receptor (GPCR)
Mol. Mass.:
52868.96
Organism:
Homo sapiens (Human)
Description:
P21554
Residue:
472
  
Inhibitor
Name:
BDBM50260720
Synonyms:
1-(5,6-bis(4-ethoxyphenyl)pyrazin-2-yl)-4-(ethylamino)piperidine-4-carboxamide | CHEMBL495892
Type:
Small organic molecule
Emp. Form.:
C28H35N5O3
Mol. Mass.:
489.6092
SMILES:
CCNC1(CCN(CC1)c1cnc(-c2ccc(OCC)cc2)c(n1)-c1ccc(OCC)cc1)C(N)=O
: