Target
Histamine H4 receptor
Ligand
BDBM22904
Substrate
Meas. Tech.
ChEMBL_552365 (CHEMBL1005955)
Ki
184±n/a nM
Citation
 Kiss, RKiss, BKönczöl, ASzalai, FJelinek, ILászló, VNoszál, BFalus, AKeseru, GM Discovery of novel human histamine H4 receptor ligands by large-scale structure-based virtual screening. J Med Chem 51:3145-53 (2008)  
Target
Name:
Histamine H4 receptor
Synonyms:
AXOR35 GPCR105 HH4R HRH4 Histamine H4 receptor Histamine receptor (H3 and H4) SP9144
Type:
G Protein-Coupled Receptor (GPCR)
Mol. Mass.:
44517.02
Organism:
Homo sapiens (Human)
Description:
Binding assays were using CHO cells stably expressing hH4R receptors.
Residue:
390
  
Inhibitor
Name:
BDBM22904
Synonyms:
(2R)-1-(1H-imidazol-5-yl)propan-2-amine Alpha-Methylhistamine-R CHEMBL268229 RAMH
Type:
Small organic molecule
Emp. Form.:
C6H11N3
Mol. Mass.:
125.1716
SMILES:
C[C@@H](N)Cc1cnc[nH]1
: