Target
Kappa-type opioid receptor
Ligand
BDBM50271815
Substrate
Meas. Tech.
ChEMBL_556764 (CHEMBL961462)
IC50
5026±n/a nM
Citation
 Martínez-Mayorga, KMedina-Franco, JLGiulianotti, MAPinilla, CDooley, CTAppel, JRHoughten, RA Conformation-opioid activity relationships of bicyclic guanidines from 3D similarity analysis. Bioorg Med Chem 16:5932-8 (2008)  
Target
Name:
Kappa-type opioid receptor
Synonyms:
Kappa Opioid Receptor OPRK1 Opiate Kappa 1 | mu/kappa opioid receptor
Type:
G Protein-Coupled Receptor (GPCR)
Mol. Mass.:
42744.99
Organism:
Cavia porcellus (domestic guinea pig)
Description:
P41144
Residue:
380
  
Inhibitor
Name:
BDBM50271815
Synonyms:
(3S,6R)-3-Cyclohexyl-7-(3-cyclohexyl-propyl)-6-(4-methoxy-benzyl)-2,5,6,7-tetrahydro-3H-imidazo[1,2-a]imidazol-1-ium
Type:
Small organic molecule
Emp. Form.:
C28H44N3O
Mol. Mass.:
438.6679
SMILES:
COc1ccc(C[C@@H]2CN3[C@H](C[NH+]=C3N2CCCC2CCCCC2)C2CCCCC2)cc1
: