Target
Translocator protein
Ligand
BDBM50271873
Substrate
Meas. Tech.
ChEMBL_556776 (CHEMBL961474)
Ki
421±n/a nM
Citation
 Yu, WWang, EVoll, RJMiller, AHGoodman, MM Synthesis, fluorine-18 radiolabeling, and in vitro characterization of 1-iodophenyl-N-methyl-N-fluoroalkyl-3-isoquinoline carboxamide derivatives as potential PET radioligands for imaging peripheral benzodiazepine receptor. Bioorg Med Chem 16:6145-55 (2008)  
Target
Name:
Translocator protein
Synonyms:
Benzodiazepine receptors; peripheral & central Mbr PBR Peripheral benzodiazepine receptor (PBR) TSPO_RAT | Tspo
Type:
Mitochondrion membrane protein
Mol. Mass.:
18945.84
Organism:
Rattus norvegicus (rat)
Description:
Competitive binding experiments were performed on rat kidney mitochondrial membranes.
Residue:
169
  
Inhibitor
Name:
BDBM50271873
Synonyms:
1-(2-Iodophenyl)-N-methyl-N-(2-fluoroethyl)-3-isoquinoline carboxamide | CHEMBL504365
Type:
Small organic molecule
Emp. Form.:
C19H16FIN2O
Mol. Mass.:
434.246
SMILES:
CN(CCF)C(=O)c1cc2ccccc2c(n1)-c1ccccc1I
: