Target
Cholinesterase
Ligand
BDBM50271518
Substrate
Meas. Tech.
ChEMBL_552458 (CHEMBL1002718)
Ki
5.04±n/a nM
Citation
 Butini, SCampiani, GBorriello, MGemma, SPanico, APersico, MCatalanotti, BRos, SBrindisi, MAgnusdei, MFiorini, INacci, VNovellino, EBelinskaya, TSaxena, AFattorusso, C Exploiting protein fluctuations at the active-site gorge of human cholinesterases: further optimization of the design strategy to develop extremely potent inhibitors. J Med Chem 51:3154-70 (2008)  
Target
Name:
Cholinesterase
Synonyms:
Acylcholine acylhydrolase Butyrylcholine esterase (BChE) Butyrylcholinesterase (BuChE) CHLE_HUMAN Cholinesterases Pseudocholinesterase
Type:
Homotetramer
Mol. Mass.:
68422.27
Organism:
Homo sapiens (Human)
Description:
P06276
Residue:
602
  
Inhibitor
Name:
BDBM50271518
Synonyms:
1,3-bis{[(1,2,3,4-Tetrahydroacridin-9-yl)amino]ethyl}-5-methylbenzene | CHEMBL507438
Type:
Small organic molecule
Emp. Form.:
C37H40N4
Mol. Mass.:
540.7403
SMILES:
Cc1cc(CCNc2c3CCCCc3nc3ccccc23)cc(CCNc2c3CCCCc3nc3ccccc23)c1
: