Target
P2Y purinoceptor 4
Ligand
BDBM50270550
Substrate
Meas. Tech.
ChEMBL_552863 (CHEMBL958068)
EC50
80±n/a nM
Citation
 Ko, HCarter, RLCosyn, LPetrelli, Rde Castro, SBesada, PZhou, YCappellacci, LFranchetti, PGrifantini, MVan Calenbergh, SHarden, TKJacobson, KA Synthesis and potency of novel uracil nucleotides and derivatives as P2Y2 and P2Y6 receptor agonists. Bioorg Med Chem 16:6319-32 (2008)  
Target
Name:
P2Y purinoceptor 4
Synonyms:
NRU P2RY4 P2Y purinoceptor 4 Pyrimidinergic receptor P2Y4 Uridine nucleotide receptor
Type:
PROTEIN
Mol. Mass.:
40977.17
Organism:
Homo sapiens (Human)
Description:
ChEMBL_751027
Residue:
365
  
Inhibitor
Name:
BDBM50270550
Synonyms:
CHEMBL503798 | {[(2R,3S,4R,5R)-3,4-dihydroxy-5-(2-oxo-4-sulfanylidene-1,2,3,4-tetrahydropyrimidin-1-yl)oxolan-2-yl]methoxy}({[({[({[(2R,3S,4R,5R)-3,4-dihydroxy-5-(2-oxo-4-sulfanylidene-1,2,3,4-tetrahydropyrimidin-1-yl)oxolan-2-yl]methoxy}(hydroxy)phosphoryl)oxy](hydroxy)phosphoryl}oxy)(hydroxy)phosphoryl]oxy})phosphinic acid
Type:
Small organic molecule
Emp. Form.:
C18H26N4O21P4S2
Mol. Mass.:
822.438
SMILES:
O[C@H]1[C@@H](O)[C@@H](O[C@@H]1COP(O)(=O)OP(O)(=O)OP(O)(=O)OP(O)(=O)OC[C@H]1O[C@H]([C@H](O)[C@@H]1O)n1ccc(=S)[nH]c1=O)n1ccc(=S)[nH]c1=O
: