Target
Procathepsin L
Ligand
BDBM50270039
Substrate
Meas. Tech.
ChEMBL_508134 (CHEMBL1004871)
IC50
>50000±n/a nM
Citation
 Méthot, NRubin, JGuay, DBeaulieu, CEthier, DReddy, TJRiendeau, DPercival, MD Inhibition of the activation of multiple serine proteases with a cathepsin C inhibitor requires sustained exposure to prevent pro-enzyme processing. J Biol Chem 282:20836-46 (2007)  
Target
Name:
Procathepsin L
Synonyms:
CATL1_HUMAN CTSL CTSL1 Cathepsin L Cathepsin L1 heavy chain MEP cathepsin L preproprotein
Type:
Enzyme
Mol. Mass.:
37557.19
Organism:
Homo sapiens (Human)
Description:
Purchased from Calbiochem (San Diego, CA).
Residue:
333
  
Inhibitor
Name:
BDBM50270039
Synonyms:
(S)-1-((1S,2S)-1-cyano-2-phenylcyclopropylamino)-1-oxo-3-(thiophen-2-yl)propan-2-aminium 2,2,2-trifluoroacetate | CHEMBL478737
Type:
Small organic molecule
Emp. Form.:
C17H18N3OS
Mol. Mass.:
312.409
SMILES:
[NH3+][C@H](Cc1cccs1)C(=O)N[C@]1(C[C@H]1c1ccccc1)C#N
: