Target
Procathepsin L
Ligand
BDBM50270029
Substrate
Meas. Tech.
ChEMBL_508134 (CHEMBL1004871)
IC50
29500±n/a nM
Citation
 Méthot, NRubin, JGuay, DBeaulieu, CEthier, DReddy, TJRiendeau, DPercival, MD Inhibition of the activation of multiple serine proteases with a cathepsin C inhibitor requires sustained exposure to prevent pro-enzyme processing. J Biol Chem 282:20836-46 (2007)  
Target
Name:
Procathepsin L
Synonyms:
CATL1_HUMAN CTSL CTSL1 Cathepsin L Cathepsin L1 heavy chain MEP cathepsin L preproprotein
Type:
Enzyme
Mol. Mass.:
37557.19
Organism:
Homo sapiens (Human)
Description:
Purchased from Calbiochem (San Diego, CA).
Residue:
333
  
Inhibitor
Name:
BDBM50270029
Synonyms:
2-Amino-N-[(S)-3-diazo-1-(4-iodo-benzyl)-2-oxo-propyl]-acetamide | CHEMBL450997
Type:
Small organic molecule
Emp. Form.:
C12H13IN4O2
Mol. Mass.:
372.1617
SMILES:
NCC(=O)N[C@@H](Cc1ccc(I)cc1)C(=O)[CH-][N+]#N
: