Target
Cathepsin S
Ligand
BDBM19516
Substrate
Meas. Tech.
ChEMBL_508133 (CHEMBL1004870)
IC50
1±n/a nM
Citation
 Méthot, NRubin, JGuay, DBeaulieu, CEthier, DReddy, TJRiendeau, DPercival, MD Inhibition of the activation of multiple serine proteases with a cathepsin C inhibitor requires sustained exposure to prevent pro-enzyme processing. J Biol Chem 282:20836-46 (2007)  
Target
Name:
Cathepsin S
Synonyms:
CATS_HUMAN Cathepsin S (Cat S) | cathepsin S preproprotein
Type:
Protein
Mol. Mass.:
37507.38
Organism:
Homo sapiens (Human)
Description:
P25774
Residue:
331
  
Inhibitor
Name:
BDBM19516
Synonyms:
(2S)-N-[(3S,5E)-6-(benzenesulfonyl)-4-oxo-1-phenylhex-5-en-3-yl]-4-methyl-2-(morpholin-4-ylcarbonylamino)pentanamide LHVS Morpholinurea-Leucine-Homophenylalaninevinyl Phenyl Sulfone
Type:
Small organic molecule
Emp. Form.:
C28H37N3O5S
Mol. Mass.:
527.675
SMILES:
CC(C)C[C@@H](NC(=O)N1CCOCC1)C(=O)N[C@H](CCc1ccccc1)C=CS(=O)(=O)c1ccccc1
: