Target
Myeloblastin
Ligand
BDBM50270040
Substrate
Meas. Tech.
ChEMBL_508159 (CHEMBL1008217)
IC50
140±n/a nM
Citation
 Méthot, NRubin, JGuay, DBeaulieu, CEthier, DReddy, TJRiendeau, DPercival, MD Inhibition of the activation of multiple serine proteases with a cathepsin C inhibitor requires sustained exposure to prevent pro-enzyme processing. J Biol Chem 282:20836-46 (2007)  
Target
Name:
Myeloblastin
Synonyms:
PRTN3_MOUSE | Prtn3
Type:
PROTEIN
Mol. Mass.:
27628.93
Organism:
Mus musculus
Description:
ChEMBL_508159
Residue:
254
  
Inhibitor
Name:
BDBM50270040
Synonyms:
(S)-1-((1R,2R)-1-cyano-2-phenylcyclopropylamino)-1-oxo-3-(thiophen-2-yl)propan-2-aminium 2,2,2-trifluoroacetate | CHEMBL516292
Type:
Small organic molecule
Emp. Form.:
C17H18N3OS
Mol. Mass.:
312.409
SMILES:
[NH3+][C@@H](Cc1cccs1)C(=O)N[C@@]1(C[C@@H]1c1ccccc1)C#N
: