Target
Solute carrier family 22 member 20
Ligand
BDBM50082199
Substrate
Meas. Tech.
ChEMBL_508178 (CHEMBL1008236)
Ki
281838±n/a nM
Citation
 Kaler, GTruong, DMKhandelwal, ANagle, MEraly, SASwaan, PWNigam, SK Structural variation governs substrate specificity for organic anion transporter (OAT) homologs. Potential remote sensing by OAT family members. J Biol Chem 282:23841-53 (2007)  
Target
Name:
Solute carrier family 22 member 20
Synonyms:
Gm963 S22AK_MOUSE | Slc22a20
Type:
PROTEIN
Mol. Mass.:
60953.19
Organism:
Mus musculus
Description:
ChEMBL_508178
Residue:
556
  
Inhibitor
Name:
BDBM50082199
Synonyms:
CH3-CH2-COOH Propionsaeure acide propionique ethanecarboxylic acid metacetonic acid propanoic acid propionic acid pseudoacetic acid
Type:
Small organic molecule
Emp. Form.:
C3H6O2
Mol. Mass.:
74.0785
SMILES:
CCC(O)=O
: