Target
Tissue factor
Ligand
BDBM19410
Substrate
Meas. Tech.
ChEMBL_508124 (CHEMBL1004861)
IC50
10000±n/a nM
Citation
 Wang, JMahmud, SABitterman, PBHuo, YSlungaard, A Histone deacetylase inhibitors suppress TF-kappaB-dependent agonist-driven tissue factor expression in endothelial cells and monocytes. J Biol Chem 282:28408-18 (2007)  
Target
Name:
Tissue factor
Synonyms:
CD_antigen=CD142 Coagulation factor VII/tissue factor TF Thromboplastin | Tissue factor
Type:
PROTEIN
Mol. Mass.:
33067.61
Organism:
Homo sapiens (Human)
Description:
ChEMBL_936735
Residue:
295
  
Inhibitor
Name:
BDBM19410
Synonyms:
CHEMBL27759 US11377423, MS-275 US9265734, MS-275 benzamide-type inhibitor, 3 | pyridin-3-ylmethyl N-({4-[(2-aminophenyl)carbamoyl]phenyl}methyl)carbamate
Type:
Small organic molecule
Emp. Form.:
C21H20N4O3
Mol. Mass.:
376.4085
SMILES:
Nc1ccccc1NC(=O)c1ccc(CNC(=O)OCc2cccnc2)cc1
: