Target
Substance-P receptor
Ligand
BDBM50140771
Substrate
Meas. Tech.
ChEMBL_528534 (CHEMBL972069)
EC50
24.4±n/a nM
Citation
 Gafner, SDietz, BMMcPhail, KLScott, IMGlinski, JARussell, FEMcCollom, MMBudzinski, JWFoster, BCBergeron, CRhyu, MRBolton, JL Alkaloids from Eschscholzia californica and their capacity to inhibit binding of [3H]8-Hydroxy-2-(di-N-propylamino)tetralin to 5-HT1A receptors in Vitro. J Nat Prod 69:432-5 (2006)  
Target
Name:
Substance-P receptor
Synonyms:
NK-1 receptor NK1 Receptor NK1R_HUMAN Neurokinin-1 (NK-1) SPR TACR1 Tachykinin receptor 1 (NK1) | tachykinin
Type:
G Protein-Coupled Receptor (GPCR)
Mol. Mass.:
46254.43
Organism:
Homo sapiens (Human)
Description:
P25103
Residue:
407
  
Inhibitor
Name:
BDBM50140771
Synonyms:
((2R,3R)-2-Benzhydryl-1-aza-bicyclo[2.2.2]oct-3-yl)-(2-iodo-benzyl)-amine CHEMBL24999 | L-703606
Type:
Small organic molecule
Emp. Form.:
C27H29IN2
Mol. Mass.:
508.437
SMILES:
Ic1ccccc1CN[C@@H]1C2CCN(CC2)[C@@H]1C(c1ccccc1)c1ccccc1
: