Target
Excitatory amino acid transporter 2
Ligand
BDBM50252662
Substrate
Meas. Tech.
ChEMBL_487937 (CHEMBL1016591)
Ki
1000000±n/a nM
Citation
 Sagot, EJensen, AAPickering, DSPu, XUmberti, MStensbøl, TBNielsen, BAssaf, ZAboab, BBolte, JGefflaut, TBunch, L Chemo-enzymatic synthesis of (2S,4R)-2-amino-4-(3-(2,2-diphenylethylamino)-3-oxopropyl)pentanedioic acid: a novel selective inhibitor of human excitatory amino acid transporter subtype 2. J Med Chem 51:4085-92 (2008)  
Target
Name:
Excitatory amino acid transporter 2
Synonyms:
EAA2_HUMAN GLT1 SLC1A2 Solute carrier family 1 member 2
Type:
Enzyme Catalytic Domain
Mol. Mass.:
62103.57
Organism:
Homo sapiens (Human)
Description:
Excitatory Amino Acid EAAT2 0 0::P43004
Residue:
574
  
Inhibitor
Name:
BDBM50252662
Synonyms:
(2S,4R)-4-(3-Propylamino-3-oxopropyl)glutamic acid | CHEMBL494878
Type:
Small organic molecule
Emp. Form.:
C11H20N2O5
Mol. Mass.:
260.2869
SMILES:
CCCNC(=O)CC[C@H](C[C@H](N)C(O)=O)C(O)=O
: