Target
Excitatory amino acid transporter 1
Ligand
BDBM50240399
Substrate
Meas. Tech.
ChEMBL_487931 (CHEMBL1016585)
IC50
>3000000±n/a nM
Citation
 Sagot, EJensen, AAPickering, DSPu, XUmberti, MStensbøl, TBNielsen, BAssaf, ZAboab, BBolte, JGefflaut, TBunch, L Chemo-enzymatic synthesis of (2S,4R)-2-amino-4-(3-(2,2-diphenylethylamino)-3-oxopropyl)pentanedioic acid: a novel selective inhibitor of human excitatory amino acid transporter subtype 2. J Med Chem 51:4085-92 (2008)  
Target
Name:
Excitatory amino acid transporter 1
Synonyms:
EAA1_HUMAN Excitatory Amino Acid EAAT1 GLAST1 | SLC1A3
Type:
Enzyme Catalytic Domain
Mol. Mass.:
59577.19
Organism:
Homo sapiens (Human)
Description:
Excitatory Amino Acid EAAT1 0 HUMAN::P43003
Residue:
542
  
Inhibitor
Name:
BDBM50240399
Synonyms:
(2R,3R,4S)-3-(carboxymethyl)-4-isopropylpyrrolidinium-2-carboxylate (2S,3S,4R)-4-isopropyl-3-(2-oxido-2-oxoethyl)pyrrolidinium-2-carboxylate Dihydrokainate | dihydrokainic acid
Type:
Small organic molecule
Emp. Form.:
C10H17NO4
Mol. Mass.:
215.2463
SMILES:
CC(C)[C@H]1CN[C@@H]([C@H]1CC(O)=O)C(O)=O
: