Target
Metabotropic glutamate receptor 1
Ligand
BDBM50252051
Substrate
Meas. Tech.
ChEMBL_487959 (CHEMBL1013090)
EC50
>100000±n/a nM
Citation
 Sagot, EPickering, DSPu, XUmberti, MStensbøl, TBNielsen, BChapelet, MBolte, JGefflaut, TBunch, L Chemo-enzymatic synthesis of a series of 2,4-syn-functionalized (S)-glutamate analogues: new insight into the structure-activity relation of ionotropic glutamate receptor subtypes 5, 6, and 7. J Med Chem 51:4093-103 (2008)  
Target
Name:
Metabotropic glutamate receptor 1
Synonyms:
GRM1_RAT Grm1 Metabotropic glutamate receptor Mglur1 metabotropic glutamate 1/5-D metabotropic glutamate receptor 1 isoform alpha precursor
Type:
Enzyme Catalytic Domain
Mol. Mass.:
133240.47
Organism:
RAT
Description:
metabotropic glutamate 1/2 0 RAT::P23385
Residue:
1199
  
Inhibitor
Name:
BDBM50252051
Synonyms:
(2S,4R)-2-amino-4-(3-(methylamino)-3-oxopropyl)pentanedioic acid CHEMBL500042
Type:
Small organic molecule
Emp. Form.:
C9H16N2O5
Mol. Mass.:
232.2337
SMILES:
CNC(=O)CC[C@H](C[C@H](N)C(O)=O)C(O)=O
: