Target
Glutamate receptor ionotropic, kainate 2
Ligand
BDBM50031704
Substrate
Meas. Tech.
ChEMBL_487957 (CHEMBL1013088)
Ki
17.0±n/a nM
Citation
 Sagot, EPickering, DSPu, XUmberti, MStensbøl, TBNielsen, BChapelet, MBolte, JGefflaut, TBunch, L Chemo-enzymatic synthesis of a series of 2,4-syn-functionalized (S)-glutamate analogues: new insight into the structure-activity relation of ionotropic glutamate receptor subtypes 5, 6, and 7. J Med Chem 51:4093-103 (2008)  
Target
Name:
Glutamate receptor ionotropic, kainate 2
Synonyms:
GRIK2_RAT Glutamate receptor ionotropic kainate 2 Ionotropic glutamate receptor kainate 2/5
Type:
PROTEIN
Mol. Mass.:
102478.61
Organism:
Rattus norvegicus
Description:
ChEMBL_936439
Residue:
908
  
Inhibitor
Name:
BDBM50031704
Synonyms:
(2S,4R)-2-Amino-4-methyl-pentanedioic acid (2S,4R)-4-methylglutamic acid CHEMBL288166
Type:
Small organic molecule
Emp. Form.:
C6H11NO4
Mol. Mass.:
161.1558
SMILES:
C[C@H](C[C@H](N)C(O)=O)C(O)=O
: