Target
Lysosomal alpha-glucosidase
Ligand
BDBM50024129
Substrate
Meas. Tech.
ChEMBL_490822 (CHEMBL993561)
IC50
18000±n/a nM
Citation
 Kuriyama, CKamiyama, OIkeda, KSanae, FKato, AAdachi, IImahori, TTakahata, HOkamoto, TAsano, N In vitro inhibition of glycogen-degrading enzymes and glycosidases by six-membered sugar mimics and their evaluation in cell cultures. Bioorg Med Chem 16:7330-6 (2008)  
Target
Name:
Lysosomal alpha-glucosidase
Synonyms:
Acidic alpha-glucosidase LYAG_RAT
Type:
PROTEIN
Mol. Mass.:
106191.24
Organism:
Rattus norvegicus
Description:
ChEMBL_1506157
Residue:
953
  
Inhibitor
Name:
BDBM50024129
Synonyms:
5-Amino-1-hydroxymethyl-cyclohexane-1,2,3,4-tetraol CHEMBL9216 Valiolamine
Type:
Small organic molecule
Emp. Form.:
C7H15NO5
Mol. Mass.:
193.1977
SMILES:
N[C@H]1C[C@](O)(CO)[C@@H](O)[C@H](O)[C@H]1O
: