Target
Glycogen debranching enzyme
Ligand
BDBM18351
Substrate
Meas. Tech.
ChEMBL_490834 (CHEMBL993573)
IC50
190±n/a nM
Citation
 Kuriyama, CKamiyama, OIkeda, KSanae, FKato, AAdachi, IImahori, TTakahata, HOkamoto, TAsano, N In vitro inhibition of glycogen-degrading enzymes and glycosidases by six-membered sugar mimics and their evaluation in cell cultures. Bioorg Med Chem 16:7330-6 (2008)  
Target
Name:
Glycogen debranching enzyme
Synonyms:
AGL | GDE_RABIT
Type:
PROTEIN
Mol. Mass.:
177662.68
Organism:
Oryctolagus cuniculus
Description:
ChEMBL_490834
Residue:
1555
  
Inhibitor
Name:
BDBM18351
Synonyms:
(2R,3R,4R,5S)-2-(Hydroxymethyl)piperidine-3,4,5-triol, 10 1-Deoxynojirimycin CHEMBL307429 US9181184, 1 | dNM
Type:
natural product
Emp. Form.:
C6H13NO4
Mol. Mass.:
163.1717
SMILES:
OC[C@H]1NC[C@H](O)[C@@H](O)[C@@H]1O
: